Target
Protein arginine N-methyltransferase 5
Ligand
BDBM297742
Substrate
Meas. Tech.
Biochemical Assay
IC50
550±n/a nM
Citation
 Duncan, KWChesworth, RBoriack-Sjodin, PAMunchhof, MJ PRMT5 inhibitors and uses thereof US Patent  US9732072 Publication Date 8/15/2017 
Target
Name:
Protein arginine N-methyltransferase 5
Synonyms:
72 kDa ICln-binding protein HRMT1L5 IBP72 Jak-binding protein 1 PRMT5/MEP50 complex Protein arginine methyltransferase 5 (PRMT5) SKB1 homolog Shk1 kinase-binding protein 1 homolog
Type:
Enzyme
Mol. Mass.:
72679.99
Organism:
Homo sapiens (Human)
Description:
O14744
Residue:
637
  
Inhibitor
Name:
BDBM297742
Synonyms:
US10118918, Compound 21 | US9732072, Compound 21
Type:
Small organic molecule
Emp. Form.:
C21H27N3O5S
Mol. Mass.:
433.521
SMILES:
CN(C)S(=O)(=O)c1ccccc1OCC(=O)NC[C@@H](O)CN1Cc2ccccc2C1
: