Target
Orexin receptor type 2
Ligand
BDBM334708
Substrate
Meas. Tech.
Inhibition Assay
IC50
251±n/a nM
Citation
 Boss, CBrotschi, CGude, MHeidmann, BSifferlen, TWilliams, J Benzimidazole-proline derivatives US Patent  US9732075 Publication Date 8/15/2017 
Target
Name:
Orexin receptor type 2
Synonyms:
HCRTR2 OX2R_HUMAN Orexin receptor type 2 (OR-2) Orexin receptor type 2 (OX2R) Ox-2-R | Ox2-R
Type:
Protein
Mol. Mass.:
50710.53
Organism:
Homo sapiens (Human)
Description:
O43614
Residue:
444
  
Inhibitor
Name:
BDBM334708
Synonyms:
US11040966, Example 4.67 [(2S,3S)-2-(5-Chloro-4-methyl-1H-benzoimidazol-2-yl)-3-methyl-pyrrolidin-1-yl]-[5-(3,5-difluoro-phenyl)-2-methyl-thiazol-4-yl]-methanone
Type:
Small organic molecule
Emp. Form.:
C24H21ClF2N4OS
Mol. Mass.:
486.965
SMILES:
C[C@H]1CCN([C@@H]1c1nc2c(C)c(Cl)ccc2[nH]1)C(=O)c1nc(C)sc1-c1cc(F)cc(F)c1
: