Target
Orexin receptor type 2
Ligand
BDBM335149
Substrate
Meas. Tech.
Inhibition Assay
IC50
1.000±n/a nM
Citation
 Boss, CBrotschi, CGude, MHeidmann, BSifferlen, TWilliams, J Benzimidazole-proline derivatives US Patent  US9732075 Publication Date 8/15/2017 
Target
Name:
Orexin receptor type 2
Synonyms:
HCRTR2 OX2R_HUMAN Orexin receptor type 2 (OR-2) Orexin receptor type 2 (OX2R) Ox-2-R | Ox2-R
Type:
Protein
Mol. Mass.:
50710.53
Organism:
Homo sapiens (Human)
Description:
O43614
Residue:
444
  
Inhibitor
Name:
BDBM335149
Synonyms:
US11040966, Example 6.110 [5-(3-Bromo-4-fluoro-phenyl)-2-methyl-thiazol-4-yl]-[(S)-2-(7-methyl-1H-benzoimidazol-2-yl)-4-methylene-pyrrolidin-1-yl]-methanone
Type:
Small organic molecule
Emp. Form.:
C24H20BrFN4OS
Mol. Mass.:
511.409
SMILES:
Cc1nc(C(=O)N2CC(=C)C[C@H]2c2nc3cccc(C)c3[nH]2)c(s1)-c1ccc(F)c(Br)c1
: