Target
Histamine H4 receptor
Ligand
BDBM50061008
Substrate
Meas. Tech.
Binding Assay
Ki
1.000±n/a nM
Citation
 Cai, HChavez, FDunford, PJGreenspan, AJMeduna, SPQuiroz, JASavall, BMTays, KLThurmond, RLWei, JWolin, RLZhang, X Diamino-pyridine, pyrimidine, and pyridazine modulators of the histamine H4 receptor US Patent  US9732087 Publication Date 8/15/2017 
Target
Name:
Histamine H4 receptor
Synonyms:
AXOR35 GPCR105 HH4R HRH4 Histamine H4 receptor Histamine receptor (H3 and H4) SP9144
Type:
G Protein-Coupled Receptor (GPCR)
Mol. Mass.:
44517.02
Organism:
Homo sapiens (Human)
Description:
Binding assays were using CHO cells stably expressing hH4R receptors.
Residue:
390
  
Inhibitor
Name:
BDBM50061008
Synonyms:
CHEMBL3393556 | US9732087, 96
Type:
Small organic molecule
Emp. Form.:
C16H25N5
Mol. Mass.:
287.4032
SMILES:
CN[C@@H]1CCN(C1)c1cnnc(NC2CC3CCC2C3)c1
: