Target
Epidermal growth factor receptor [L858R]
Ligand
BDBM199996
Substrate
Meas. Tech.
TBD
IC50
0.460±n/a nM
Citation
 Zhou, CZhang, G Fused tricyclic amide compounds as multiple kinase inhibitors US Patent  US9670231 Publication Date 6/6/2017 
Target
Name:
Epidermal growth factor receptor [L858R]
Synonyms:
EGFR EGFR_HUMAN ERBB1 Epidermal growth factor receptor (L858R) HER1
Type:
Mol. Mass.:
134323.62
Organism:
Homo sapiens (Human)
Description:
P00533[L858R]
Residue:
1210
  
Inhibitor
Name:
BDBM199996
Synonyms:
US9670231, 1.4
Type:
Small organic molecule
Emp. Form.:
C31H32FN5O4
Mol. Mass.:
557.6153
SMILES:
CCN1CCN(Cc2ccc(cc2F)C(=O)N[C@@H]2[C@H]3Oc4ccc(Oc5ccnc6NC(=O)CCc56)cc4[C@@H]23)CC1
: