Target
Epidermal growth factor receptor [L858R]
Ligand
BDBM200336
Substrate
Meas. Tech.
TBD
IC50
0.160±n/a nM
Citation
 Zhou, CZhang, G Fused tricyclic amide compounds as multiple kinase inhibitors US Patent  US9670231 Publication Date 6/6/2017 
Target
Name:
Epidermal growth factor receptor [L858R]
Synonyms:
EGFR EGFR_HUMAN ERBB1 Epidermal growth factor receptor (L858R) HER1
Type:
Mol. Mass.:
134323.62
Organism:
Homo sapiens (Human)
Description:
P00533[L858R]
Residue:
1210
  
Inhibitor
Name:
BDBM200336
Synonyms:
US9670231, 1.12
Type:
Small organic molecule
Emp. Form.:
C33H32F3N5O4
Mol. Mass.:
619.6335
SMILES:
FC(F)(F)c1cc(ccc1CN1CCN2CCC[C@@H]2C1)C(=O)N[C@@H]1[C@H]2Oc3ccc(Oc4ccnc5NC(=O)CCc45)cc3[C@@H]12
: