Target
Epidermal growth factor receptor [L858R]
Ligand
BDBM200478
Substrate
Meas. Tech.
TBD
IC50
<0.250±n/a nM
Citation
 Zhou, CZhang, G Fused tricyclic amide compounds as multiple kinase inhibitors US Patent  US9670231 Publication Date 6/6/2017 
Target
Name:
Epidermal growth factor receptor [L858R]
Synonyms:
EGFR EGFR_HUMAN ERBB1 Epidermal growth factor receptor (L858R) HER1
Type:
Mol. Mass.:
134323.62
Organism:
Homo sapiens (Human)
Description:
P00533[L858R]
Residue:
1210
  
Inhibitor
Name:
BDBM200478
Synonyms:
US9670231, 1.18
Type:
Small organic molecule
Emp. Form.:
C31H32ClN5O4
Mol. Mass.:
574.07
SMILES:
CCN1CCN(Cc2ccc(cc2Cl)C(=O)N[C@@H]2[C@H]3Oc4ccc(Oc5ccnc6NC(=O)CCc56)cc4[C@@H]23)CC1
: