Target
Epidermal growth factor receptor [L858R]
Ligand
BDBM200584
Substrate
Meas. Tech.
TBD
IC50
0.350±n/a nM
Citation
 Zhou, CZhang, G Fused tricyclic amide compounds as multiple kinase inhibitors US Patent  US9670231 Publication Date 6/6/2017 
Target
Name:
Epidermal growth factor receptor [L858R]
Synonyms:
EGFR EGFR_HUMAN ERBB1 Epidermal growth factor receptor (L858R) HER1
Type:
Mol. Mass.:
134323.62
Organism:
Homo sapiens (Human)
Description:
P00533[L858R]
Residue:
1210
  
Inhibitor
Name:
BDBM200584
Synonyms:
US9670231, 1.55
Type:
Small organic molecule
Emp. Form.:
C33H34F3N5O4
Mol. Mass.:
621.6494
SMILES:
CCN1CCN(Cc2ccc(cc2C(F)(F)F)C(=O)NC2C3Oc4c(cc(Oc5ccnc6NC(=O)CCc56)cc4C)C23)CC1
: