Target
Epidermal growth factor receptor [L858R]
Ligand
BDBM200807
Substrate
Meas. Tech.
TBD
IC50
0.470±n/a nM
Citation
 Zhou, CZhang, G Fused tricyclic amide compounds as multiple kinase inhibitors US Patent  US9670231 Publication Date 6/6/2017 
Target
Name:
Epidermal growth factor receptor [L858R]
Synonyms:
EGFR EGFR_HUMAN ERBB1 Epidermal growth factor receptor (L858R) HER1
Type:
Mol. Mass.:
134323.62
Organism:
Homo sapiens (Human)
Description:
P00533[L858R]
Residue:
1210
  
Inhibitor
Name:
BDBM200807
Synonyms:
US9670231, 2.5
Type:
Small organic molecule
Emp. Form.:
C29H30F3N5O3
Mol. Mass.:
553.5754
SMILES:
CCN1CCN(Cc2ccc(cc2C(F)(F)F)C(=O)N[C@@H]2[C@H]3Oc4ccc(Oc5ccnc(N)c5)cc4[C@@H]23)CC1
: