Target
Transient receptor potential cation channel subfamily V member 1
Ligand
BDBM244829
Substrate
Meas. Tech.
Functional Assay
IC50
23.0±n/a nM
Citation
 Allison, BDBranstetter, BJBreitenbucher, JGHack, MDHawryluk, NALebsack, ADMcClure, KJMerit, JE Tetrahydro-pyrimidoazepines as modulators of TRPV1 US Patent  US9738649 Publication Date 8/22/2017 
Target
Name:
Transient receptor potential cation channel subfamily V member 1
Synonyms:
Capsaicin receptor TRPV1_RAT Trpv1 Vanilloid VR1 Vanilloid receptor 1 (VRI/TRPV1) Vanilloid receptor type 1-like (TrpV1/Vr1) Vr1l | osm-9-like TRP channel 1
Type:
Transient Receptor
Mol. Mass.:
94956.12
Organism:
Rattus norvegicus (rat)
Description:
O35433
Residue:
838
  
Inhibitor
Name:
BDBM244829
Synonyms:
US9422293, 39 and 39A | US9738649, Example 39A
Type:
Small organic molecule
Emp. Form.:
C26H26F6N6
Mol. Mass.:
536.5153
SMILES:
FC(F)(F)c1ccc(Nc2nc(nc3CCN(CCc23)c2ncccc2C(F)(F)F)N2CCCCC2)cc1
: