Target
Intermediate conductance calcium-activated potassium channel protein 4
Ligand
BDBM50019900
Substrate
Meas. Tech.
KCa3.1 Assay
IC50
49±0 nM
Citation
 Burke, MJMcKibben, BTschantz, MA Fused thiazin-3-ones as KCA3.1 inhibitors US Patent  US9533999 Publication Date 1/3/2017 
Target
Name:
Intermediate conductance calcium-activated potassium channel protein 4
Synonyms:
IK1 KCA4 KCNN4_HUMAN SK4
Type:
PROTEIN
Mol. Mass.:
47723.22
Organism:
Homo sapiens (Human)
Description:
ChEMBL_1361891
Residue:
427
  
Inhibitor
Name:
BDBM50019900
Synonyms:
CHEMBL3287205 | US9533999, i-5
Type:
Small organic molecule
Emp. Form.:
C15H10F4N2O4S
Mol. Mass.:
390.31
SMILES:
Fc1ccc(CN2C(=O)CS(=O)(=O)c3cccnc23)cc1OC(F)(F)F
: