Target
Intermediate conductance calcium-activated potassium channel protein 4
Ligand
BDBM50019903
Substrate
Meas. Tech.
KCa3.1 Assay
IC50
48±0 nM
Citation
 Burke, MJMcKibben, BTschantz, MA Fused thiazin-3-ones as KCA3.1 inhibitors US Patent  US9533999 Publication Date 1/3/2017 
Target
Name:
Intermediate conductance calcium-activated potassium channel protein 4
Synonyms:
IK1 KCA4 KCNN4_HUMAN SK4
Type:
PROTEIN
Mol. Mass.:
47723.22
Organism:
Homo sapiens (Human)
Description:
ChEMBL_1361891
Residue:
427
  
Inhibitor
Name:
BDBM50019903
Synonyms:
CHEMBL3287208 | US9533999, i-40
Type:
Small organic molecule
Emp. Form.:
C14H9F4NO4S2
Mol. Mass.:
395.349
SMILES:
Fc1ccc(CN2c3ccsc3S(=O)(=O)CC2=O)cc1OC(F)(F)F
: