Target
Intermediate conductance calcium-activated potassium channel protein 4
Ligand
BDBM50019904
Substrate
Meas. Tech.
KCa3.1 Assay
IC50
52±0 nM
Citation
 Burke, MJMcKibben, BTschantz, MA Fused thiazin-3-ones as KCA3.1 inhibitors US Patent  US9533999 Publication Date 1/3/2017 
Target
Name:
Intermediate conductance calcium-activated potassium channel protein 4
Synonyms:
IK1 KCA4 KCNN4_HUMAN SK4
Type:
PROTEIN
Mol. Mass.:
47723.22
Organism:
Homo sapiens (Human)
Description:
ChEMBL_1361891
Residue:
427
  
Inhibitor
Name:
BDBM50019904
Synonyms:
CHEMBL3287209 | US9533999, ii-1
Type:
Small organic molecule
Emp. Form.:
C15H11F3N2O2S
Mol. Mass.:
340.32
SMILES:
FC(F)(F)Oc1cccc(CN2C(=O)CSc3cccnc23)c1
: