Target
Nuclear receptor ROR-gamma
Ligand
BDBM332453
Substrate
Meas. Tech.
Biochemical TR-FRET Assay
IC50
491±n/a nM
Citation
 Barr, KJBienstock, CEMaclean, JKZhang, HBeresis, RTZhang, DAnthony, NJLapointe, BTTian, Y 4-heteroaryl substituted benzoic acid compounds as RORgammaT inhibitors and uses thereof US Patent  US9745265 Publication Date 8/29/2017 
Target
Name:
Nuclear receptor ROR-gamma
Synonyms:
Nr1f3 Nuclear receptor subfamily 1 group F member 3 RORG_MOUSE Rorc TOR Thymus orphan receptor
Type:
PROTEIN
Mol. Mass.:
58133.31
Organism:
Mus musculus
Description:
ChEMBL_103664
Residue:
516
  
Inhibitor
Name:
BDBM332453
Synonyms:
4-(1-(2-chloro- 6-(trifluoro- methyl)benzoyl)- 6-(1,3-dimethyl- ureido)-1H- indazol-3-yl)-3-fluorobenzoic US9745265, 5H
Type:
Small organic molecule
Emp. Form.:
C25H17ClF4N4O4
Mol. Mass.:
548.873
SMILES:
CNC(=O)N(C)c1ccc2c(nn(C(=O)c3c(Cl)cccc3C(F)(F)F)c2c1)-c1ccc(cc1F)C(O)=O
: