Target
Isoform 2 of MAP kinase-interacting serine/threonine-protein kinase 1 (MNK1a) 344D]
Ligand
BDBM337246
Substrate
Meas. Tech.
Kinase High ATP Assay
IC50
3.00±n/a nM
Citation
 Zorn, LEis, KSchulze, VSülzle, DPuehler, FLienau, PBömer, UPetersen, KHägebarth, A Amidoimidazopyridazines as MKNK-1 kinase inhibitors US Patent  US9745304 Publication Date 8/29/2017 
Target
Name:
Isoform 2 of MAP kinase-interacting serine/threonine-protein kinase 1 (MNK1a) 344D]
Synonyms:
Isoform 2 of MAP kinase-interacting serine/threonine-protein kinase 1 (MNK1a) 344D] MAP kinase signal-integrating kinase 1 (MNK1) (T344D) MAP kinase-interacting serine/threonine-protein kinase 1 (MKNK1) (T344D) MAP kinase-interacting serine/threonine-protein kinase 1 (MNK1a) [T344D] MKNK1 MKNK1_HUMAN MNK1a
Type:
Protein
Mol. Mass.:
47416.00
Organism:
Homo sapiens (Human)
Description:
Q9BUB5-2 with T344D
Residue:
424
  
Inhibitor
Name:
BDBM337246
Synonyms:
(2R)-2-hydroxy-N-[3-(4-methoxyfuro[3,2-c]pyridin-2-yl)imidazo[1,2-b]-pyridazin-6-yl]propanamide | US9745304, Example 15
Type:
Small organic molecule
Emp. Form.:
C17H15N5O4
Mol. Mass.:
353.3321
SMILES:
COc1nccc2oc(cc12)-c1cnc2ccc(NC(=O)[C@@H](C)O)nn12
: