Target
Dimer of Gag-Pol polyprotein [489-587,K509R,V521I,L522F,M525I,L552P,A560V,V571A,I573V,L579M]
Ligand
BDBM580
Substrate
HIV Protease Chromogenic Peptide Substrate
Meas. Tech.
Protease Inhibition Assay
Ki
0.55±n/a nM
Citation
 Clemente, JCMoose, REHemrajani, RWhitford, LRGovindasamy, LReutzel, RMcKenna, RAgbandje-McKenna, MGoodenow, MMDunn, BM Comparing the accumulation of active- and nonactive-site mutations in the HIV-1 protease. Biochemistry 43:12141-51 (2004)  
Target
Name:
Dimer of Gag-Pol polyprotein [489-587,K509R,V521I,L522F,M525I,L552P,A560V,V571A,I573V,L579M]
Synonyms:
HIV-1 Protease Mutant V6(84) | HIV-1 protease mutant (K20R V32I L33F M36I L63P A71V V82A I84V L90M)
Type:
Protein Complex
Mol. Mass.:
Description:
The post-ritonavir therapy protease variant plus I84V mutation, which was created by site-directed mutagenesis.
Components:
This complex has 2 components.
Component 1
Name:
Gag-Pol polyprotein [489-587,K509R,V521I,L522F,M525I,L552P,A560V,V571A,I573V,L579M]
Synonyms:
HIV-1 Protease Mutant V6(84) chain A POL_HV1H2 | gag-pol
Type:
Enzyme Subunit
Mol. Mass.:
10827.15
Organism:
Human immunodeficiency virus type 1
Description:
P04585[489-587,K509R,V521I,L522F,M525I,L552P,A560V,V571A,I573V,L579M]
Residue:
99
  
Component 2
Name:
Gag-Pol polyprotein [489-587,K509R,V521I,L522F,M525I,L552P,A560V,V571A,I573V,L579M]
Synonyms:
HIV-1 Protease Mutant V6(84) chain A POL_HV1H2 | gag-pol
Type:
Enzyme Subunit
Mol. Mass.:
10827.15
Organism:
Human immunodeficiency virus type 1
Description:
P04585[489-587,K509R,V521I,L522F,M525I,L552P,A560V,V571A,I573V,L579M]
Residue:
99
  
Inhibitor
Name:
BDBM580
Synonyms:
(4R)-3-[(2S,3S)-2-hydroxy-3-[(3-hydroxy-2-methylphenyl)formamido]-4-phenylbutanoyl]-5,5-dimethyl-N-[(2-methylphenyl)methyl]-1,3-thiazolidine-4-carboxamide BDBM50288366 KNI-764
Type:
Small organic molecule
Emp. Form.:
C32H37N3O5S
Mol. Mass.:
575.718
SMILES:
Cc1ccccc1CNC(=O)[C@H]1N(CSC1(C)C)C(=O)[C@@H](O)[C@H](Cc1ccccc1)NC(=O)c1cccc(O)c1C
:
Substrate
Name:
HIV Protease Chromogenic Peptide Substrate
Synonyms:
Type:
Peptide
Mol. Mass.:
1420.11
Organism:
Description:
Residue:
13
KARVLNPHEANLG