Target
Beta-secretase 2
Ligand
BDBM338840
Substrate
Meas. Tech.
Biochemical FRET Based Assay
IC50
1.86±n/a nM
Citation
 Oehlrich, DGijsen, HJ 4-amino-6-phenyl-6,7-dihydro[1,2,3]triazolo[1,5-A]pyrazine derivatives as inhibitors of beta-secretase (BACE) US Patent  US9751886 Publication Date 9/5/2017 
Target
Name:
Beta-secretase 2
Synonyms:
AEPLC ASP1 Asp 1 Aspartyl protease 1 BACE2_HUMAN Beta-secretase (BACE) Beta-secretase 2 (BACE-2) Beta-site APP-cleaving enzyme 2 Memapsin-1 beta-Secretase (BACE-2)
Type:
Protein
Mol. Mass.:
56171.20
Organism:
Homo sapiens (Human)
Description:
Q9Y5Z0
Residue:
518
  
Inhibitor
Name:
BDBM338840
Synonyms:
N-{3-[(6R)-4-Amino-6-methyl-6,7-dihydro[1,2,3]triazolo[1,5-a]pyrazin-6-yl]-4-fluorophenyl}-4-chloro-1-(difluoromethyl)-1H-pyrazole-3-carboxamide | US9751886, Compound 5
Type:
Small organic molecule
Emp. Form.:
C17H14ClF3N8O
Mol. Mass.:
438.794
SMILES:
C[C@]1(Cn2nncc2C(N)=N1)c1cc(NC(=O)c2nn(cc2Cl)C(F)F)ccc1F
: