Target
Dimer of Gag-Pol polyprotein [482-580,I502K,I528M,T553A]
Ligand
BDBM520
Substrate
HIV Protease Chromogenic Peptide Substrate
Meas. Tech.
Protease Inhibition Assay
pH
4.7±n/a
Temperature
310.15±n/a K
Ki
0.2±0.1 nM
Km
15000±2000 nM
Comments
kcat/Km=0.54 +/- 0.07 uM-1sec-1
Citation
 Clemente, JCComan, RMThiaville, MMJanka, LKJeung, JANukoolkarn, SGovindasamy, LAgbandje-McKenna, MMcKenna, RLeelamanit, WGoodenow, MMDunn, BM Analysis of HIV-1 CRF_01 A/E protease inhibitor resistance: structural determinants for maintaining sensitivity and developing resistance to atazanavir. Biochemistry 45:5468-77 (2006)  
Target
Name:
Dimer of Gag-Pol polyprotein [482-580,I502K,I528M,T553A]
Synonyms:
HIV-1 CRF_01 A/E Protease Pretherapy isolated AE protease containing the natural V3I, I13V, E35D, M36I, S37N, R41K, H69K, and L89M polymorphisms
Type:
Protein Complex
Mol. Mass.:
Description:
HIV-1 protease DNA for all the HIV B and AE variants was cloned, and protein was expressed and purified from Escherichia coli strain BL21.
Components:
This complex has 2 components.
Component 1
Name:
Gag-Pol polyprotein [482-580,I502K,I528M,T553A]
Synonyms:
HIV-1 Protease AE Chain A POL_HV1U4 | gag-pol
Type:
Enzyme Subunit
Mol. Mass.:
10757.68
Organism:
Human immunodeficiency virus type 1
Description:
P24740[482-580,I502K,I528M,T553A]
Residue:
99
  
Component 2
Name:
Gag-Pol polyprotein [482-580,I502K,I528M,T553A]
Synonyms:
HIV-1 Protease AE Chain A POL_HV1U4 | gag-pol
Type:
Enzyme Subunit
Mol. Mass.:
10757.68
Organism:
Human immunodeficiency virus type 1
Description:
P24740[482-580,I502K,I528M,T553A]
Residue:
99
  
Inhibitor
Name:
BDBM520
Synonyms:
1,3-thiazol-5-ylmethyl N-[(2S,3S,5S)-3-hydroxy-5-[(2S)-3-methyl-2-{[methyl({[2-(propan-2-yl)-1,3-thiazol-4-yl]methyl})carbamoyl]amino}butanamido]-1,6-diphenylhexan-2-yl]carbamate CHEMBL163 RTV | Ritonavir
Type:
Small organic molecule
Emp. Form.:
C37H48N6O5S2
Mol. Mass.:
720.944
SMILES:
CC(C)[C@H](NC(=O)N(C)Cc1csc(n1)C(C)C)C(=O)N[C@H](C[C@H](O)[C@H](Cc1ccccc1)NC(=O)OCc1cncs1)Cc1ccccc1
:
Substrate
Name:
HIV Protease Chromogenic Peptide Substrate
Synonyms:
Type:
Peptide
Mol. Mass.:
1420.11
Organism:
Description:
Residue:
13
KARVLNPHEANLG