Target
Dimer of Gag-Pol polyprotein [490-588,L523I,E525D,M526I,I544V,L553H,H559K,V572F,L579M]
Ligand
BDBM578
Substrate
HIV Protease Chromogenic Peptide Substrate
Meas. Tech.
Protease Inhibition Assay
Ki
9±n/a nM
Citation
 Clemente, JCComan, RMThiaville, MMJanka, LKJeung, JANukoolkarn, SGovindasamy, LAgbandje-McKenna, MMcKenna, RLeelamanit, WGoodenow, MMDunn, BM Analysis of HIV-1 CRF_01 A/E protease inhibitor resistance: structural determinants for maintaining sensitivity and developing resistance to atazanavir. Biochemistry 45:5468-77 (2006)  
Target
Name:
Dimer of Gag-Pol polyprotein [490-588,L523I,E525D,M526I,I544V,L553H,H559K,V572F,L579M]
Synonyms:
HIV-1 Protease AE-P Post-therapy HIV-1 CRF_01 A/E protease
Type:
Protein Complex
Mol. Mass.:
Description:
HIV-1 protease DNA for all the HIV B and AE variants was cloned, and protein was expressed and purified from Escherichia coli strain BL21.
Components:
This complex has 2 components.
Component 1
Name:
Gag-Pol polyprotein [490-588,L523I,E525D,M526I,I544V,L553H,H559K,V572F,L579M]
Synonyms:
HIV-1 Protease AE-P Chain A POL_HV1RH | gag-pol
Type:
Enzyme Subunit
Mol. Mass.:
10816.18
Organism:
Human immunodeficiency virus type 1
Description:
P05959[490-588,L523I,E525D,M526I,I544V,L553H,H559K,V572F,L579M]
Residue:
99
  
Component 2
Name:
Gag-Pol polyprotein [490-588,L523I,E525D,M526I,I544V,L553H,H559K,V572F,L579M]
Synonyms:
HIV-1 Protease AE-P Chain A POL_HV1RH | gag-pol
Type:
Enzyme Subunit
Mol. Mass.:
10816.18
Organism:
Human immunodeficiency virus type 1
Description:
P05959[490-588,L523I,E525D,M526I,I544V,L553H,H559K,V572F,L579M]
Residue:
99
  
Inhibitor
Name:
BDBM578
Synonyms:
(2S)-N-[(2S,4S,5S)-5-[2-(2,6-dimethylphenoxy)acetamido]-4-hydroxy-1,6-diphenylhexan-2-yl]-3-methyl-2-(2-oxo-1,3-diazinan-1-yl)butanamide Aluviran LPV | Lopinavir
Type:
Small organic molecule
Emp. Form.:
C37H48N4O5
Mol. Mass.:
628.8008
SMILES:
CC(C)[C@H](N1CCCNC1=O)C(=O)N[C@H](C[C@H](O)[C@H](Cc1ccccc1)NC(=O)COc1c(C)cccc1C)Cc1ccccc1
:
Substrate
Name:
HIV Protease Chromogenic Peptide Substrate
Synonyms:
Type:
Peptide
Mol. Mass.:
1420.11
Organism:
Description:
Residue:
13
KARVLNPHEANLG