Target
Histone deacetylase 1
Ligand
BDBM50248522
Substrate
Meas. Tech.
In Vitro HDAC Assay
IC50
39.0±n/a nM
Citation
 Chen, DSong, HYSun, ETYu, NZou, Y Benzimidazole derivatives: preparation and pharmaceutical applications US Patent  US10201527 Publication Date 2/12/2019 
Target
Name:
Histone deacetylase 1
Synonyms:
Cereblon/Histone deacetylase 1 HDAC1 Histone deacetylase 1 (HDAC1) RPD3L1
Type:
Enzyme
Mol. Mass.:
55090.27
Organism:
Homo sapiens (Human)
Description:
Q13547
Residue:
482
  
Inhibitor
Name:
BDBM50248522
Synonyms:
CHEMBL489332 US10201527, Compound 67 US8551988, 67
Type:
Small organic molecule
Emp. Form.:
C25H30N4O2
Mol. Mass.:
418.5313
SMILES:
ONC(=O)\C=C\c1ccc2n(CCN3CCCCC3)c(CCc3ccccc3)nc2c1
: