Target
Beta-2 adrenergic receptor
Ligand
BDBM200750
Substrate
Meas. Tech.
Binding Assay
IC50
1.50±n/a nM
Citation
 Aiguade Bosch, JGual Roig, SPrat Quinones, MPuig Duran, C Cyclohexylamine derivatives having β2 adrenergic agonist and M3 muscarinic antagonist activities US Patent  US9757383 Publication Date 9/12/2017 
Target
Name:
Beta-2 adrenergic receptor
Synonyms:
ADRB2 ADRB2_HUMAN Beta-2 adrenoceptor | Beta-2 adrenoreceptor
Type:
Mol. Mass.:
46461.69
Organism:
Homo sapiens (Human)
Description:
P07550
Residue:
413
  
Inhibitor
Name:
BDBM200750
Synonyms:
US9233108, 15 | US9757383, Example 15
Type:
Small organic molecule
Emp. Form.:
C44H46N4O8
Mol. Mass.:
758.858
SMILES:
CN(CCCn1c2ccc(CNC[C@H](O)c3ccc(O)c4[nH]c(=O)ccc34)cc2oc1=O)[C@H]1CC[C@@H](CC1)OC(=O)C1(C)c2ccccc2Oc2ccccc12
: