Target
Tyrosine-protein kinase BTK
Ligand
BDBM340031
Substrate
Meas. Tech.
Inhibition Activity Assay
IC50
0.100±n/a nM
Citation
 Hong, YRNa, JEMin, ISCha, HJKwon, SKRo, SCho, JM 2,3-dihydro-isoindole-1-on derivative as BTK kinase suppressant, and pharmaceutical composition including same US Patent  US9758508 Publication Date 9/12/2017 
Target
Name:
Tyrosine-protein kinase BTK
Synonyms:
AGMX1 Agammaglobulinaemia tyrosine kinase B cell progenitor kinase BPK BTK_HUMAN Tyrosine Kinase BTK Tyrosine-protein kinase BTK (BTK)
Type:
Enzyme
Mol. Mass.:
76289.95
Organism:
Homo sapiens (Human)
Description:
Q06187
Residue:
659
  
Inhibitor
Name:
BDBM340031
Synonyms:
1-{3-fluoro-4-[7-(5-methyl-1H-imidazol-2- yl)-1-oxo-2,3-dihydro-1H-isoindol-4-yl]- phenyl}-3-(2,4,6-trifluoro-phenyl)-urea US11230539, Compound 7 | US9758508, Compound 7
Type:
Small organic molecule
Emp. Form.:
C25H17F4N5O2
Mol. Mass.:
495.4284
SMILES:
Cc1cnc([nH]1)-c1ccc(c2CNC(=O)c12)-c1ccc(NC(=O)Nc2c(F)cc(F)cc2F)cc1F
: