Target
CREB-binding protein
Ligand
BDBM50200383
Substrate
Meas. Tech.
TR-FRET Binding Assay
IC50
30.0±n/a nM
Citation
 Adler, MAlbrecht, BKBronner, SChen, KXCôté, ACrawford, TCyr, PEgen, JKauder, SLai, KWLiao, JMagnuson, SMurray, JPastor, RRomero, FATaylor, AMTsui, VHWang, FZhu, B Therapeutic compounds and uses thereof US Patent  US9763922 Publication Date 9/19/2017 
Target
Name:
CREB-binding protein
Synonyms:
CBP CREB-binding protein (CBP) CREBBP
Type:
Transcription Coactivator
Mol. Mass.:
265411.66
Organism:
Homo sapiens (Human)
Description:
Q92793
Residue:
2442
  
Inhibitor
Name:
BDBM50200383
Synonyms:
CHEMBL3938408 | US9763922, Example 73
Type:
Small organic molecule
Emp. Form.:
C22H26N6O
Mol. Mass.:
390.4814
SMILES:
CC(=O)N1CCc2c(C1)c(Nc1cccc(c1)-c1ccnn1C)nn2CC1CC1
: