Target
Bromodomain-containing protein 4
Ligand
BDBM50200383
Substrate
Meas. Tech.
AlphaLisa Binding Assay
IC50
3050±n/a nM
Citation
 Adler, MAlbrecht, BKBronner, SChen, KXCôté, ACrawford, TCyr, PEgen, JKauder, SLai, KWLiao, JMagnuson, SMurray, JPastor, RRomero, FATaylor, AMTsui, VHWang, FZhu, B Therapeutic compounds and uses thereof US Patent  US9763922 Publication Date 9/19/2017 
Target
Name:
Bromodomain-containing protein 4
Synonyms:
BRD4 Bromodomain-containing protein 4 (BRD4) Protein HUNK1
Type:
Protein
Mol. Mass.:
152264.84
Organism:
Homo sapiens (Human)
Description:
O60885
Residue:
1362
  
Inhibitor
Name:
BDBM50200383
Synonyms:
CHEMBL3938408 | US9763922, Example 73
Type:
Small organic molecule
Emp. Form.:
C22H26N6O
Mol. Mass.:
390.4814
SMILES:
CC(=O)N1CCc2c(C1)c(Nc1cccc(c1)-c1ccnn1C)nn2CC1CC1
: