Target
Large neutral amino acids transporter small subunit 2
Ligand
BDBM340646
Substrate
IC50
261000±n/a nM
Citation
 Kanai, YNagamori, SKitaura, YNeya, MMatsushita, N Phenoxyalkylamine compound US Patent  US9771316 Publication Date 9/26/2017 
Target
Name:
Large neutral amino acids transporter small subunit 2
Synonyms:
LAT2 SLC7A8
Type:
Protein
Mol. Mass.:
58378.41
Organism:
Homo sapiens (Human)
Description:
Q9UHI5
Residue:
535
  
Inhibitor
Name:
BDBM340646
Synonyms:
US9771316, Example 51
Type:
Small organic molecule
Emp. Form.:
C19H27NOS
Mol. Mass.:
317.489
SMILES:
CCC(C)c1ccc(OC(CCCCN)c2cccs2)cc1
: