Target
Large neutral amino acids transporter small subunit 2
Ligand
BDBM340661
Substrate
IC50
194000±n/a nM
Citation
 Kanai, YNagamori, SKitaura, YNeya, MMatsushita, N Phenoxyalkylamine compound US Patent  US9771316 Publication Date 9/26/2017 
Target
Name:
Large neutral amino acids transporter small subunit 2
Synonyms:
LAT2 SLC7A8
Type:
Protein
Mol. Mass.:
58378.41
Organism:
Homo sapiens (Human)
Description:
Q9UHI5
Residue:
535
  
Inhibitor
Name:
BDBM340661
Synonyms:
US9771316, Example 66
Type:
Small organic molecule
Emp. Form.:
C18H20F3NO
Mol. Mass.:
323.3527
SMILES:
NCCCC[C@@H](Oc1ccc(cc1)C(F)(F)F)c1ccccc1
: