Target
Large neutral amino acids transporter small subunit 2
Ligand
BDBM340672
Substrate
IC50
131300±n/a nM
Citation
 Kanai, YNagamori, SKitaura, YNeya, MMatsushita, N Phenoxyalkylamine compound US Patent  US9771316 Publication Date 9/26/2017 
Target
Name:
Large neutral amino acids transporter small subunit 2
Synonyms:
LAT2 SLC7A8
Type:
Protein
Mol. Mass.:
58378.41
Organism:
Homo sapiens (Human)
Description:
Q9UHI5
Residue:
535
  
Inhibitor
Name:
BDBM340672
Synonyms:
US9771316, Example 70
Type:
Small organic molecule
Emp. Form.:
C18H20F3NO2
Mol. Mass.:
339.3521
SMILES:
NCCCC[C@@H](Oc1ccc(OC(F)(F)F)cc1)c1ccccc1
: