Target
Prothrombin
Ligand
BDBM14340
Substrate
BDBM12679
Meas. Tech.
Enzyme Assay and Determination of the Inhibition Constants
Ki
160000±n/a nM
Citation
 Katz, BAElrod, KVerner, EMackman, RLLuong, CShrader, WDSendzik, MSpencer, JRSprengeler, PAKolesnikov, ATai, VWHui, HCBreitenbucher, JGAllen, DJanc, JW Elaborate manifold of short hydrogen bond arrays mediating binding of active site-directed serine protease inhibitors. J Mol Biol 329:93-120 (2003)  
Target
Name:
Prothrombin
Synonyms:
Activation peptide fragment 1 Coagulation factor II Prothrombin precursor Thrombin heavy chain | Thrombin light chain
Type:
Protein
Mol. Mass.:
70029.57
Organism:
Homo sapiens (Human)
Description:
P00734
Residue:
622
  
Inhibitor
Name:
BDBM14340
Synonyms:
(2R)-2-(3-{5-[amino(iminiumyl)methyl]-1H-1,3-benzodiazol-2-yl}-4-oxido-5-phenylphenyl)butanedioate CRA-16935
Type:
Small organic molecule
Emp. Form.:
C24H18N4O5
Mol. Mass.:
442.4246
SMILES:
NC(=[NH2+])c1ccc2nc([nH]c2c1)-c1cc(cc(-c2ccccc2)c1[O-])[C@@H](CC([O-])=O)C([O-])=O
:
Substrate
Name:
BDBM12679
Synonyms:
BDBM13790 Chromogenic Substrate
Type:
Small organic molecule
Emp. Form.:
C26H34N6O7S
Mol. Mass.:
574.649
SMILES:
Cc1ccc(cc1)S(=O)(=O)NCC(=O)N1CCCC1C(=O)NC(CCCCN)C(=O)Nc1ccc(cc1)[N+]([O-])=O
: