Target
Protein farnesyltransferase subunit beta/geranylgeranyltransferase type-1 subunit alpha
Ligand
BDBM14465
Substrate
Ha-Ras-CVLS
Meas. Tech.
In Vitro Enzyme Assay of FPT
pH
7.5±n/a
Temperature
295.15±n/a K
IC50
16.7±n/a nM
Citation
 Njoroge, FGTaveras, AGKelly, JRemiszewski, SMallams, AKWolin, RAfonso, ACooper, ABRane, DFLiu, YTWong, JVibulbhan, BPinto, PDeskus, JAlvarez, CSdel Rosario, JConnolly, MWang, JDesai, JRossman, RRBishop, WRPatton, RWang, LKirschmeier, PGanguly, AK (+)-4-[2-[4-(8-Chloro-3,10-dibromo-6,11-dihydro-5H-benzo[5, 6]cyclohepta[1,2-b]- pyridin-11(R)-yl)-1-piperidinyl]-2-oxo-ethyl]-1-piperidinecarboxamid e (SCH-66336): a very potent farnesyl protein transferase inhibitor as a novel antitumor agent. J Med Chem 41:4890-902 (1998)  
Target
Name:
Protein farnesyltransferase subunit beta/geranylgeranyltransferase type-1 subunit alpha
Synonyms:
Farnesyltransferase (FTase) Protein Farnesyltransferase (PFT) Chain B | Protein farnesyltransferase
Type:
Protein Complex
Mol. Mass.:
Description:
To express recombinant enzyme in E. coli, the cloned human alpha and beta subunits were co-expressed from a plasmid, in which their expression was translationally coupled.
Components:
This complex has 2 components.
Component 1
Name:
Protein farnesyltransferase subunit beta
Synonyms:
CAAX farnesyltransferase subunit alpha FNTB FTase-alpha GGTase-I-alpha Protein farnesyl/geranylgeranyl transferase Protein farnesyltransferase subunit beta Protein farnesyltransferase/geranylgeranyltransferase type-1 subunit alpha Ras proteins prenyltransferase subunit beta | Type I protein geranyl-geranyltransferase subunit alpha
Type:
Enzyme Subunit
Mol. Mass.:
48766.02
Organism:
Homo sapiens (Human)
Description:
Protein farnesyltransferase subunit beta
Residue:
437
  
Component 2
Name:
Protein farnesyltransferase/geranylgeranyltransferase type-1 subunit alpha
Synonyms:
CAAX farnesyltransferase alpha subunit FNTA_HUMAN FTase-alpha Geranylgeranyl Transferase (GGTase-I) Chain A Protein Farnesyltransferase (PFT) Chain A Protein farnesyltransferase Protein farnesyltransferase/geranylgeranyltransferase type I alpha subunit | Ras proteins prenyltransferase alpha
Type:
Enzyme
Mol. Mass.:
44392.46
Organism:
Homo sapiens (Human)
Description:
Recombinant human FTase.
Residue:
379
  
Inhibitor
Name:
BDBM14465
Synonyms:
(+)-4-(3-Bromo-8-chloro-10-fluoro-6,11-dihydro-5H-benzo-[5,6]cyclohepta[1,2-b]pyridin-11(R)-yl)-4-(4-pyridinylacetyl)-piperazine N4-Oxide Trihalobenzocycloheptapyridine Tricyclic Compound 37
Type:
Small organic molecule
Emp. Form.:
C25H23BrClFN4O2
Mol. Mass.:
545.831
SMILES:
[O-][n+]1ccc(CC(=O)N2CCN(CC2)[C@H]2c3ncc(Br)cc3CCc3cc(Cl)cc(F)c23)cc1
:
Substrate
Name:
GTPase HRas
Synonyms:
GTPase HRas, N-terminally processed H-Ras-1 HRAS1 His6-Ha-Ras-CVLS Transforming protein p21 Wild-type Ha-Ras p21ras
Type:
Other Protein Type
Mol. Mass.:
21293.37
Organism:
Homo sapiens (Human)
Description:
P01112
Residue:
189