Target
Urokinase-type plasminogen activator
Ligand
BDBM14148
Substrate
BDBM14484
Meas. Tech.
Enzyme Assay and Determination of the Inhibition Constants
Ki
150±n/a nM
Citation
 Katz, BALuong, CHo, JDSomoza, JRGjerstad, ETang, JWilliams, SRVerner, EMackman, RLYoung, WBSprengeler, PAChan, HMortara, KJanc, JWMcGrath, ME Dissecting and designing inhibitor selectivity determinants at the S1 site using an artificial Ala190 protease (Ala190 uPA). J Mol Biol 344:527-47 (2004)  
Target
Name:
Urokinase-type plasminogen activator
Synonyms:
3.4.21.73 U-plasminogen activator Urokinase Urokinase-type plasminogen activator chain B Urokinase-type plasminogen activator short chain A uPA
Type:
Enzyme
Mol. Mass.:
48528.62
Organism:
Homo sapiens (Human)
Description:
P00749
Residue:
431
  
Inhibitor
Name:
BDBM14148
Synonyms:
2-{5-[amino(iminiumyl)methyl]-6-fluoro-1H-1,3-benzodiazol-2-yl}-6-(2-methylpropoxy)benzen-1-olate CA-10
Type:
Small organic molecule
Emp. Form.:
C18H19FN4O2
Mol. Mass.:
342.3675
SMILES:
CC(C)COc1cccc(-c2nc3cc(F)c(cc3[nH]2)C(N)=[NH2+])c1[O-]
:
Substrate
Name:
BDBM14484
Synonyms:
4-{[({4-carbamimidamido-1-[(4-methyl-2-oxo-2H-chromen-7-yl)carbamoyl]butyl}carbamoyl)methyl]carbamoyl}butanoic acid hydrochloride uPA Substrate
Type:
Emp. Form.:
Mol. Mass.:
SMILES:
: