Target
Tyrosine-protein kinase JAK2
Ligand
BDBM246852
Substrate
Meas. Tech.
In Vitro JAK Kinase Assay
IC50
<1000±n/a nM
Citation
 Li, YZhu, WMei, S Tricyclic fused thiophene derivatives as JAK inhibitors US Patent  US9777017 Publication Date 10/3/2017 
Target
Name:
Tyrosine-protein kinase JAK2
Synonyms:
JAK-2 JAK2_HUMAN Janus kinase 2 (JAK2) | Janus kinase 2 (a protein tyrosine kinase)
Type:
Protein
Mol. Mass.:
130684.68
Organism:
Homo sapiens (Human)
Description:
O60674
Residue:
1132
  
Inhibitor
Name:
BDBM246852
Synonyms:
((2R,5S)-5-{2-[(1R)- 1-hydroxyethyl]-1H- imidazo[4,5- d]thieno[3,2- b]pyridin-1- yl}tetrahydro-2H- pyran-2- yl)acetonitrile US10065963, Compound 1 US10370387, Example 20 US10519163, Example 1 US11084822, Example 1 US11161855, Example 20 US11324749, Comp. No. 5 US11596632, Comp. No. 5 US9732097, Example 1 US9908895, Example 20
Type:
Small organic molecule
Emp. Form.:
C17H18N4O2S
Mol. Mass.:
342.415
SMILES:
C[C@@H](O)c1nc2cnc3ccsc3c2n1[C@H]1CC[C@H](CC#N)OC1
: