Target
Carbonic anhydrase 4
Ligand
BDBM14722
Substrate
BDBM11326
Meas. Tech.
Esterase Assay
Ki
2.0±n/a nM
Citation
 Casey, JRMorgan, PEVullo, DScozzafava, AMastrolorenzo, ASupuran, CT Carbonic anhydrase inhibitors. Design of selective, membrane-impermeant inhibitors targeting the human tumor-associated isozyme IX. J Med Chem 47:2337-47 (2004)  
Target
Name:
Carbonic anhydrase 4
Synonyms:
CA-IV CAH4_BOVIN Carbonic Anhydrase IV Carbonic anhydrase 4
Type:
Enzyme
Mol. Mass.:
35152.74
Organism:
Bos taurus (bovine)
Description:
Bovine isozyme, isolated from lung microsomes
Residue:
312
  
Inhibitor
Name:
BDBM14722
Synonyms:
1-N-[5-Sulfamoyl-1,3,4-thiadiazol-2-yl-(aminosulfonyl-4-phenyl)]-2,6-dimethyl-4-phenylpyridinium perchlorate Sulfonamide, 8 | pyridinium-containing sulfonamide analog 14e
Type:
Small organic molecule
Emp. Form.:
C21H20N5O4S3
Mol. Mass.:
502.609
SMILES:
Cc1cc(cc(C)[n+]1-c1ccc(cc1)S(=O)(=O)Nc1nnc(s1)S(N)(=O)=O)-c1ccccc1
:
Substrate
Name:
BDBM11326
Synonyms:
4-nitrophenyl acetate | p-Nitrophenyl Acetate
Type:
Small organic molecule
Emp. Form.:
C8H7NO4
Mol. Mass.:
181.1455
SMILES:
CC(=O)Oc1ccc(cc1)[N+]([O-])=O
: