Target
CREB-binding protein
Ligand
BDBM349385
Substrate
Meas. Tech.
CBP TR-FRET Binding Assay
IC50
591±n/a nM
Citation
 Romero, FAMagnuson, SRPastor, RTsui, VHMurray, JCrawford, TBurdick, DJAlbrecht, BKCote, ATaylor, AMNasveschuck, CGLeBlanc, YHewitt, MCLai, KWChen, K Therapeutic compounds and uses thereof US Patent  US10206931 Publication Date 2/19/2019 
Target
Name:
CREB-binding protein
Synonyms:
CBP CREB-binding protein (CBP) CREBBP
Type:
Transcription Coactivator
Mol. Mass.:
265411.66
Organism:
Homo sapiens (Human)
Description:
Q92793
Residue:
2442
  
Inhibitor
Name:
BDBM349385
Synonyms:
US10206931, Example 193 | methyl 1-methyl-2-[(4R)-4-
Type:
Small organic molecule
Emp. Form.:
C21H21N3O3
Mol. Mass.:
363.4097
SMILES:
COC(=O)c1ccc2cc(-c3cccc4NC(=O)C[C@@H](C)Nc34)n(C)c2c1
: