Target
Bromodomain-containing protein 4 [42-168]
Ligand
BDBM349385
Substrate
Meas. Tech.
BRD4 AlphaLisa Binding Assay
IC50
>19700±n/a nM
Citation
 Romero, FAMagnuson, SRPastor, RTsui, VHMurray, JCrawford, TBurdick, DJAlbrecht, BKCote, ATaylor, AMNasveschuck, CGLeBlanc, YHewitt, MCLai, KWChen, K Therapeutic compounds and uses thereof US Patent  US10206931 Publication Date 2/19/2019 
Target
Name:
Bromodomain-containing protein 4 [42-168]
Synonyms:
BRD4 BRD4_HUMAN HUNK1
Type:
Enzyme Catalytic Domain
Mol. Mass.:
15054.68
Organism:
Homo sapiens (Human)
Description:
O60885[42-168]
Residue:
127
  
Inhibitor
Name:
BDBM349385
Synonyms:
US10206931, Example 193 | methyl 1-methyl-2-[(4R)-4-
Type:
Small organic molecule
Emp. Form.:
C21H21N3O3
Mol. Mass.:
363.4097
SMILES:
COC(=O)c1ccc2cc(-c3cccc4NC(=O)C[C@@H](C)Nc34)n(C)c2c1
: