Target
Intermediate conductance calcium-activated potassium channel protein 4
Ligand
BDBM205016
Substrate
Meas. Tech.
Inhibition Assay
pH
7.3±n/a
IC50
37.0±0 nM
Comments
extracted
Citation
 Demnitz, JJorgensen, S Tetrazole derivatives and their use as potassium channel modulators US Patent  US9556132 Publication Date 1/31/2017 
Target
Name:
Intermediate conductance calcium-activated potassium channel protein 4
Synonyms:
IK1 KCA4 KCNN4_HUMAN SK4
Type:
PROTEIN
Mol. Mass.:
47723.22
Organism:
Homo sapiens (Human)
Description:
ChEMBL_1361891
Residue:
427
  
Inhibitor
Name:
BDBM205016
Synonyms:
US9556132, 3 | process for preparing 5-[2-(2-ethoxyphenyl)phenyl]-1-(2-fluorophenyl)-1h-1,2,3,4-tetrazole
Type:
Small organic molecule
Emp. Form.:
C21H17FN4O
Mol. Mass.:
360.3843
SMILES:
CCOc1ccccc1-c1ccccc1-c1nnnn1-c1ccccc1F
: