Target
Tyrosine-protein kinase Lck [245-498]
Ligand
BDBM14958
Substrate
Gastrin Peptide Substrate
Meas. Tech.
Homogeneous Time-Resolved Fluorescence (HTRF) Enzyme Assay
IC50
210±n/a nM
Citation
 Cee, VJAlbrecht, BKGeuns-Meyer, SHughes, PBellon, SBready, JCaenepeel, SChaffee, SCCoxon, AEmery, MFretland, JGallant, PGu, YHodous, BLHoffman, DJohnson, REKendall, RKim, JLLong, AMMcGowan, DMorrison, MOlivieri, PRPatel, VFPolverino, APowers, DRose, PWang, LZhao, H Alkynylpyrimidine amide derivatives as potent, selective, and orally active inhibitors of Tie-2 kinase. J Med Chem 50:627-40 (2007)  
Target
Name:
Tyrosine-protein kinase Lck [245-498]
Synonyms:
LCK LSK Proto-oncogene tyrosine-protein kinase LCK p56-LCK
Type:
Kinase domain
Mol. Mass.:
29166.29
Organism:
Homo sapiens (Human)
Description:
Recombinant kinase domain (amino acid 245 to 498) fused with GST tag.
Residue:
254
  
Inhibitor
Name:
BDBM14958
Synonyms:
5-[(2-aminopyrimidin-5-yl)ethynyl]-2-fluoro-N-[2-(4-methylpiperazin-1-yl)-5-(trifluoromethyl)phenyl]benzamide alkynylpyrimidine amide 6i
Type:
Small organic molecule
Emp. Form.:
C25H22F4N6O
Mol. Mass.:
498.4754
SMILES:
CN1CCN(CC1)c1ccc(cc1NC(=O)c1cc(ccc1F)C#Cc1cnc(N)nc1)C(F)(F)F
:
Substrate
Name:
Gastrin Peptide Substrate
Synonyms:
Biotinylated gastrin peptide substrate gastrin substrate
Type:
Peptide
Mol. Mass.:
1823.88
Organism:
Description:
Residue:
15
ITINEEEEAYGWLDF