Target
Orexin receptor type 2
Ligand
BDBM205126
Substrate
Orexin receptor 1
Meas. Tech.
Radioligand binding assay
Ki
0.3±n/a nM
Citation
 Kuduk, SDSkudlarek, JW 2-pyridyloxy-3-substituted-4-nitrile orexin receptor antagonists US Patent  US9546152 Publication Date 1/17/2017 
Target
Name:
Orexin receptor type 2
Synonyms:
HCRTR2 OX2R_HUMAN Orexin receptor type 2 (OR-2) Orexin receptor type 2 (OX2R) Ox-2-R | Ox2-R
Type:
Protein
Mol. Mass.:
50710.53
Organism:
Homo sapiens (Human)
Description:
O43614
Residue:
444
  
Inhibitor
Name:
BDBM205126
Synonyms:
2-{[(3r,6r)-1-{[5-fluoro-2- (1,3-thiazol-2-yl)pyridin-3- yl]carbonyl}-6- methylpiperidin-3-yl]oxy}-3- methylpyridine-4-carbonitrile | US9546152, example 35
Type:
Small organic molecule
Emp. Form.:
C22H20FN5O2S
Mol. Mass.:
437.49
SMILES:
C[C@@H]1CC[C@H](CN1C(=O)c1cc(F)cnc1-c1nccs1)Oc1nccc(C#N)c1C
:
Substrate
Name:
Orexin/Hypocretin receptor type 1
Synonyms:
HCRTR1 OX1R_HUMAN Orexin receptor type 1 (OR 1) Orexin receptor type 1 (OX1) Orexin receptor type 1 (OxR1) | Ox1r
Type:
Protein
Mol. Mass.:
47554.50
Organism:
Homo sapiens (Human)
Description:
O43613
Residue:
425