Target
RAC-gamma serine/threonine-protein kinase
Ligand
BDBM15022
Substrate
biotinylated Akt peptide substrate
Meas. Tech.
Akt Kinase Assay
IC50
354±n/a nM
Citation
 Li, QLi, TZhu, GDGong, JClaibone, ADalton, CLuo, YJohnson, EFShi, YLiu, XKlinghofer, VBauch, JLMarsh, KCBouska, JJArries, SDe Jong, ROltersdorf, TStoll, VSJakob, CGRosenberg, SHGiranda, VL Discovery of trans-3,4'-bispyridinylethylenes as potent and novel inhibitors of protein kinase B (PKB/Akt) for the treatment of cancer: Synthesis and biological evaluation. Bioorg Med Chem Lett 16:1679-85 (2006)  
Target
Name:
RAC-gamma serine/threonine-protein kinase
Synonyms:
AKT3 PKB gamma Protein kinase Akt-3 Protein kinase B, gamma RAC-gamma serine/threonine-protein kinase Serine/threonine-protein kinase AKT | Serine/threonine-protein kinase AKT3
Type:
Enzyme
Mol. Mass.:
55769.36
Organism:
Homo sapiens (Human)
Description:
Residue:
479
  
Inhibitor
Name:
BDBM15022
Synonyms:
3-[(2S)-2-amino-3-({5-[(E)-2-(pyridin-4-yl)ethenyl]pyridin-3-yl}oxy)propyl]-1H-indole pyridine-base inhibitor 1b | trans-bispyridinylethylene analog 2q
Type:
Small organic molecule
Emp. Form.:
C23H22N4O
Mol. Mass.:
370.447
SMILES:
N[C@H](COc1cncc(\C=C\c2ccncc2)c1)Cc1c[nH]c2ccccc12
:
Substrate
Name:
biotinylated Akt peptide substrate
Synonyms:
Type:
Biotinylated Peptide
Mol. Mass.:
3178.04
Organism:
Description:
Km=15 uM
Residue:
28