Target
Indoleamine 2,3-dioxygenase 1
Ligand
BDBM223000
Substrate
Meas. Tech.
Enzyme Assay
IC50
<200±n/a nM
Citation
 Combs, APYue, EWSparks, RBZhu, W 1,2,5-oxadiazoles as inhibitors of indoleamine 2,3-dioxygenase US Patent  US9789094 Publication Date 10/17/2017 
Target
Name:
Indoleamine 2,3-dioxygenase 1
Synonyms:
I23O1_HUMAN IDO-1 INDO Indoleamine 2,3-dioxygenase | Indoleamine-pyrrole 2,3-dioxygenase
Type:
Enzyme
Mol. Mass.:
45330.80
Organism:
Homo sapiens (Human)
Description:
P14902
Residue:
403
  
Inhibitor
Name:
BDBM223000
Synonyms:
US10034939, Example 2 US9320732, 2 | US9789094, 2
Type:
Small organic molecule
Emp. Form.:
C12H14BrFN6O4S
Mol. Mass.:
437.245
SMILES:
CS(=O)(=O)NCCNc1nonc1C(Nc1ccc(F)c(Br)c1)=NO
: