Target
Dimer of Gag-Pol polyprotein [600-1159,L699I,K702N,C879S]
Ligand
BDBM1434
Substrate
poly(rA).oligo(dT)12-18
Meas. Tech.
HIV-1 RT Assay
IC50
77200±n/a nM
Citation
 Herschhorn, ALerman, LWeitman, MGleenberg, IONudelman, AHizi, A De Novo Parallel Design, Synthesis and Evaluation of Inhibitors against the Reverse Transcriptase of Human Immunodeficiency Virus Type-1 and Drug-Resi J Med Chem 50:2370-84 (2007)  
Target
Name:
Dimer of Gag-Pol polyprotein [600-1159,L699I,K702N,C879S]
Synonyms:
HIV-1 Reverse Transcriptase Mutant (L100I/K103N)
Type:
Protein Complex
Mol. Mass.:
Description:
The double mutant L100I/K103N was expressed in E. coli as a homodimer enzyme with two identical 66 kDa subunits.
Components:
This complex has 2 components.
Component 1
Name:
Gag-Pol polyprotein [600-1159,L699I,K702N,C879S]
Synonyms:
HIV-1 Reverse Transcriptase Mutant (L100I/K103N) Chain A POL_HV1B1 | gag-pol
Type:
Enzyme Subunit
Mol. Mass.:
64410.35
Organism:
Human immunodeficiency virus type 1
Description:
P03366[600-1159,L699I,K702N,C879S]
Residue:
560
  
Component 2
Name:
Gag-Pol polyprotein [600-1159,L699I,K702N,C879S]
Synonyms:
HIV-1 Reverse Transcriptase Mutant (L100I/K103N) Chain A POL_HV1B1 | gag-pol
Type:
Enzyme Subunit
Mol. Mass.:
64410.35
Organism:
Human immunodeficiency virus type 1
Description:
P03366[600-1159,L699I,K702N,C879S]
Residue:
560
  
Inhibitor
Name:
BDBM1434
Synonyms:
11-cyclopropyl-5,11-dihydro-4-methyl-6H-dipyrido[3,2-b:2 ,3 -e][1,4]diazepin-6-one BI-RG-587 Nevirapine US11420959, Example NVP | Viramune
Type:
Small organic molecule
Emp. Form.:
C15H14N4O
Mol. Mass.:
266.2979
SMILES:
Cc1ccnc2N(C3CC3)c3ncccc3C(=O)Nc12
:
Substrate
Name:
poly(rA).oligo(dT)12-18
Synonyms:
Type:
RNA/DNA duplex
Mol. Mass.:
358.43
Organism:
Description:
The incorporation of [3H]dTTP into poly(rA).oligo(dT)12-18 template-primer.
Residue:
3
NA