Target
Prothrombin
Ligand
BDBM16303
Substrate
BDBM12679
Meas. Tech.
Enzyme Inhibition Assay
Ki
2310±n/a nM
Citation
 Katz, BAClark, JMFiner-Moore, JSJenkins, TEJohnson, CRRoss, MJLuong, CMoore, WRStroud, RM Design of potent selective zinc-mediated serine protease inhibitors. Nature 391:608-12 (1998)  
Target
Name:
Prothrombin
Synonyms:
Activation peptide fragment 1 Coagulation factor II Prothrombin precursor Thrombin heavy chain | Thrombin light chain
Type:
Protein
Mol. Mass.:
70029.57
Organism:
Homo sapiens (Human)
Description:
P00734
Residue:
622
  
Inhibitor
Name:
BDBM16303
Synonyms:
2-(1H-1,3-benzodiazol-2-ylmethyl)-1H-1,3-benzodiazole-6-carboximidamide APD-1 | CHEMBL46148
Type:
Small organic molecule
Emp. Form.:
C16H14N6
Mol. Mass.:
290.3226
SMILES:
NC(=N)c1ccc2nc(Cc3nc4ccccc4[nH]3)[nH]c2c1
:
Substrate
Name:
BDBM12679
Synonyms:
BDBM13790 Chromogenic Substrate
Type:
Small organic molecule
Emp. Form.:
C26H34N6O7S
Mol. Mass.:
574.649
SMILES:
Cc1ccc(cc1)S(=O)(=O)NCC(=O)N1CCCC1C(=O)NC(CCCCN)C(=O)Nc1ccc(cc1)[N+]([O-])=O
: