Target
Tryptase beta-2
Ligand
BDBM16308
Substrate
BDBM12679
Meas. Tech.
Enzyme Inhibition Assay
Ki
8800±n/a nM
Citation
 Katz, BAClark, JMFiner-Moore, JSJenkins, TEJohnson, CRRoss, MJLuong, CMoore, WRStroud, RM Design of potent selective zinc-mediated serine protease inhibitors. Nature 391:608-12 (1998)  
Target
Name:
Tryptase beta-2
Synonyms:
TPS2 TRYB2_HUMAN Tryptase II Tryptase-2
Type:
PROTEIN
Mol. Mass.:
30518.79
Organism:
Homo sapiens (Human)
Description:
ChEMBL_210702
Residue:
275
  
Inhibitor
Name:
BDBM16308
Synonyms:
2-(isoquinolin-1-yl)-1H-1,3-benzodiazole-6-carboximidamide APD-6
Type:
Small organic molecule
Emp. Form.:
C17H13N5
Mol. Mass.:
287.3186
SMILES:
NC(=N)c1ccc2nc([nH]c2c1)-c1nccc2ccccc12
:
Substrate
Name:
BDBM12679
Synonyms:
BDBM13790 Chromogenic Substrate
Type:
Small organic molecule
Emp. Form.:
C26H34N6O7S
Mol. Mass.:
574.649
SMILES:
Cc1ccc(cc1)S(=O)(=O)NCC(=O)N1CCCC1C(=O)NC(CCCCN)C(=O)Nc1ccc(cc1)[N+]([O-])=O
: