Target
Mitogen-activated protein kinase 14
Ligand
BDBM16392
Substrate
biotinylated GST-ATF2
Meas. Tech.
Enzyme Inhibition Assay
IC50
1.1±n/a nM
Citation
 McClure, KFLetavic, MAKalgutkar, ASGabel, CAAudoly, LBarberia, JTBraganza, JFCarter, DCarty, TJCortina, SRDombroski, MADonahue, KMElliott, NCGibbons, CPJordan, CKKuperman, AVLabasi, JMLaliberte, REMcCoy, JMNaiman, BMNelson, KLNguyen, HTPeese, KMSweeney, FJTaylor, TJTrebino, CEAbramov, YALaird, ERVolberg, WAZhou, JBach, JLombardo, F Structure-activity relationships of triazolopyridine oxazole p38 inhibitors: identification of candidates for clinical development. Bioorg Med Chem Lett 16:4339-44 (2006)  
Target
Name:
Mitogen-activated protein kinase 14
Synonyms:
CSAID-binding protein CSBP1 CSPB1 MAP kinase 14 MAP kinase p38 alpha MAPK14 MK14_HUMAN Mitogen-activated protein kinase p38 alpha Stress-activated protein kinase 2a | p38 MAP kinase alpha/beta
Type:
Serine/threonine-protein kinase
Mol. Mass.:
41286.76
Organism:
Homo sapiens (Human)
Description:
Q16539
Residue:
360
  
Inhibitor
Name:
BDBM16392
Synonyms:
4-(2,4-difluorophenyl)-5-[3-(1-methylcyclobutyl)-[1,2,4]triazolo[3,4-a]pyridin-6-yl]-1,3-oxazole | triazolopyridine oxazole inhibitor 63
Type:
Small organic molecule
Emp. Form.:
C20H16F2N4O
Mol. Mass.:
366.364
SMILES:
CC1(CCC1)c1nnc2ccc(cn12)-c1ocnc1-c1ccc(F)cc1F
:
Substrate
Name:
biotinylated GST-ATF2
Synonyms:
ATF-2-GST Activating transcription factor 2 GST-ATF2 biotinylated activating transcription factor 2
Type:
Other Protein Type
Mol. Mass.:
12237.77
Organism:
Homo sapiens (Human)
Description:
Residue:
109