Target
Ephrin type-A receptor 2
Ligand
BDBM351308
Substrate
Meas. Tech.
AlphaScreen Assay
IC50
525±n/a nM
Citation
 Rice, KDAnand, NKBussenius, JCostanzo, SKennedy, ARPeto, CJTsang, THBlazey, CM Substituted quinazolines as receptor-type kinase inhibitors US Patent  US9796704 Publication Date 10/24/2017 
Target
Name:
Ephrin type-A receptor 2
Synonyms:
ECK EPHA2_HUMAN Epithelial cell kinase | Tyrosine-protein kinase receptor ECK
Type:
PROTEIN
Mol. Mass.:
108260.70
Organism:
Homo sapiens (Human)
Description:
ChEMBL_1505248
Residue:
976
  
Inhibitor
Name:
BDBM351308
Synonyms:
N-(4-bromo-2,3-dichlorophenyl)-7-{[(3S,8aS)- hexahydro-1H-pyrrolo[2,1-c][1,4]oxazin-3- ylmethyl]oxy}-6-(methyloxy)quinazolin-4- amine | US9796704, Entry 39
Type:
Small organic molecule
Emp. Form.:
C23H23BrCl2N4O3
Mol. Mass.:
554.264
SMILES:
COc1cc2c(Nc3ccc(Br)c(Cl)c3Cl)ncnc2cc1OC[C@@H]1CN2CCC[C@H]2CO1
: