Target
Vascular endothelial growth factor receptor 2
Ligand
BDBM351460
Substrate
Meas. Tech.
AlphaScreen Assay
IC50
525±n/a nM
Citation
 Rice, KDAnand, NKBussenius, JCostanzo, SKennedy, ARPeto, CJTsang, THBlazey, CM Substituted quinazolines as receptor-type kinase inhibitors US Patent  US9796704 Publication Date 10/24/2017 
Target
Name:
Vascular endothelial growth factor receptor 2
Synonyms:
CD_antigen=CD309 Fetal liver kinase 1 (FLK-1) KDR Protein-tyrosine kinase receptor Flk-1 VEGFR-2 VEGFR2 Vascular Endothelial Growth Factor Receptor Kinase 2 Vascular endothelial growth factor receptor 2 (KDR) Vascular endothelial growth factor receptor 2 (VEGFR2) Vascular endothelial growth factor receptor-2 (VEGFR-2)
Type:
Receptor Tyrosine Kinase
Mol. Mass.:
151510.97
Organism:
Homo sapiens (Human)
Description:
P35968
Residue:
1356
  
Inhibitor
Name:
BDBM351460
Synonyms:
N-(3,4-dichlorophenyl)-6-(methyloxy)-7-[({3- [4-(methyloxy)phenyl]isoxazol-5- yl}methyl)oxy]quinazolin-4-amine | US9796704, Entry 180
Type:
Small organic molecule
Emp. Form.:
C26H20Cl2N4O4
Mol. Mass.:
523.367
SMILES:
COc1ccc(cc1)-c1cc(COc2cc3ncnc(Nc4ccc(Cl)c(Cl)c4)c3cc2OC)on1
: