Target
SRSF protein kinase 1
Ligand
BDBM221070
Substrate
Meas. Tech.
In Vitro Kinase Assay
IC50
440±n/a nM
Citation
 Bates, DMorris, J Piperazine derivatives for treating disorders US Patent  US9796707 Publication Date 10/24/2017 
Target
Name:
SRSF protein kinase 1
Synonyms:
SRPK1 SRSF protein kinase 1 (SRPK1) Serine/threonine-protein kinase SRPK1
Type:
Protein
Mol. Mass.:
74318.38
Organism:
Homo sapiens (Human)
Description:
Q96SB4
Residue:
655
  
Inhibitor
Name:
BDBM221070
Synonyms:
SPHINX US9796707, Reference Compound SPHINX
Type:
Small organic molecule
Emp. Form.:
C17H17F3N2O3
Mol. Mass.:
354.3237
SMILES:
Cc1ccc(o1)C(=O)Nc1cc(ccc1N1CCOCC1)C(F)(F)F
: