Target
SRSF protein kinase 1
Ligand
BDBM101659
Substrate
Meas. Tech.
In Vitro Kinase Assay
IC50
38.2±n/a nM
Citation
 Bates, DMorris, J Piperazine derivatives for treating disorders US Patent  US9796707 Publication Date 10/24/2017 
Target
Name:
SRSF protein kinase 1
Synonyms:
SRPK1 SRSF protein kinase 1 (SRPK1) Serine/threonine-protein kinase SRPK1
Type:
Protein
Mol. Mass.:
74318.38
Organism:
Homo sapiens (Human)
Description:
Q96SB4
Residue:
655
  
Inhibitor
Name:
BDBM101659
Synonyms:
US9695160, 16 | US9796707, Compound 16
Type:
Small organic molecule
Emp. Form.:
C23H23F3N4O2
Mol. Mass.:
444.4495
SMILES:
Cc1ccc(o1)C(=O)Nc1cc(ccc1N1CCN(Cc2ccccn2)CC1)C(F)(F)F
: