Target
SRSF protein kinase 1
Ligand
BDBM101671
Substrate
Meas. Tech.
In Vitro Kinase Assay
IC50
13.9±n/a nM
Citation
 Bates, DMorris, J Piperazine derivatives for treating disorders US Patent  US9796707 Publication Date 10/24/2017 
Target
Name:
SRSF protein kinase 1
Synonyms:
SRPK1 SRSF protein kinase 1 (SRPK1) Serine/threonine-protein kinase SRPK1
Type:
Protein
Mol. Mass.:
74318.38
Organism:
Homo sapiens (Human)
Description:
Q96SB4
Residue:
655
  
Inhibitor
Name:
BDBM101671
Synonyms:
US9695160, 18 | US9796707, Compound 18
Type:
Small organic molecule
Emp. Form.:
C30H26F3N5O2
Mol. Mass.:
545.5549
SMILES:
FC(F)(F)c1ccc(N2CCN(Cc3ccccn3)CC2)c(NC(=O)c2ccc(o2)-c2ccc3[nH]ccc3c2)c1
: