Target
SRSF protein kinase 1
Ligand
BDBM101734
Substrate
Meas. Tech.
In Vitro Kinase Assay
IC50
1.90±n/a nM
Citation
 Bates, DMorris, J Piperazine derivatives for treating disorders US Patent  US9796707 Publication Date 10/24/2017 
Target
Name:
SRSF protein kinase 1
Synonyms:
SRPK1 SRSF protein kinase 1 (SRPK1) Serine/threonine-protein kinase SRPK1
Type:
Protein
Mol. Mass.:
74318.38
Organism:
Homo sapiens (Human)
Description:
Q96SB4
Residue:
655
  
Inhibitor
Name:
BDBM101734
Synonyms:
US9695160, 31 | US9796707, Compound 31
Type:
Small organic molecule
Emp. Form.:
C23H24F3N5O2S
Mol. Mass.:
491.529
SMILES:
CSc1nccc(CN2CCN(CC2)c2ccc(cc2NC(=O)c2ccc(C)o2)C(F)(F)F)n1
: