Target
SRSF protein kinase 1
Ligand
BDBM101739
Substrate
Meas. Tech.
In Vitro Kinase Assay
IC50
4027±n/a nM
Citation
 Bates, DMorris, J Piperazine derivatives for treating disorders US Patent  US9796707 Publication Date 10/24/2017 
Target
Name:
SRSF protein kinase 1
Synonyms:
SRPK1 SRSF protein kinase 1 (SRPK1) Serine/threonine-protein kinase SRPK1
Type:
Protein
Mol. Mass.:
74318.38
Organism:
Homo sapiens (Human)
Description:
Q96SB4
Residue:
655
  
Inhibitor
Name:
BDBM101739
Synonyms:
US9695160, 33 | US9796707, Compound 33
Type:
Small organic molecule
Emp. Form.:
C27H24F3N5O2
Mol. Mass.:
507.507
SMILES:
FC(F)(F)c1ccc(N2CCN(Cc3ccccn3)CC2)c(NC(=O)c2cnc(o2)-c2ccccc2)c1
: